Target
Glucose-dependent insulinotropic receptor
Ligand
BDBM50342679
Substrate
Meas. Tech.
ChEMBL_745193 (CHEMBL1772424)
EC50
6±n/a nM
Citation
 Szewczyk, JWActon, JAdams, ADChicchi, GFreeman, SHoward, ADHuang, YLi, CMeinke, PTMosely, RMurphy, ESamuel, RSantini, CYang, MZhang, YZhao, KWood, HB Design of potent and selective GPR119 agonists for type II diabetes. Bioorg Med Chem Lett 21:2665-9 (2011)  
Target
Name:
Glucose-dependent insulinotropic receptor
Synonyms:
G-protein coupled receptor 119 (GPR119) GPR119 | Glucose-dependent insulinotropic receptor
Type:
Protein
Mol. Mass.:
36901.49
Organism:
Homo sapiens (Human)
Description:
Q8TDV5
Residue:
335
  
Inhibitor
Name:
BDBM50342679
Synonyms:
CHEMBL1771080 | tert-butyl 1'-(6-cyanopyrimidin-4-yl)-4,4'-bipiperidine-1-carboxylate
Type:
Small organic molecule
Emp. Form.:
C20H29N5O2
Mol. Mass.:
371.4766
SMILES:
CC(C)(C)OC(=O)N1CCC(CC1)C1CCN(CC1)c1cc(ncn1)C#N
: