Target
Glucose-dependent insulinotropic receptor
Ligand
BDBM50342690
Substrate
Meas. Tech.
ChEMBL_745193 (CHEMBL1772424)
EC50
13±n/a nM
Citation
 Szewczyk, JWActon, JAdams, ADChicchi, GFreeman, SHoward, ADHuang, YLi, CMeinke, PTMosely, RMurphy, ESamuel, RSantini, CYang, MZhang, YZhao, KWood, HB Design of potent and selective GPR119 agonists for type II diabetes. Bioorg Med Chem Lett 21:2665-9 (2011)  
Target
Name:
Glucose-dependent insulinotropic receptor
Synonyms:
G-protein coupled receptor 119 (GPR119) GPR119 | Glucose-dependent insulinotropic receptor
Type:
Protein
Mol. Mass.:
36901.49
Organism:
Homo sapiens (Human)
Description:
Q8TDV5
Residue:
335
  
Inhibitor
Name:
BDBM50342690
Synonyms:
1-(4-(methylsulfonyl)phenyl)-1'-(5-(trifluoromethyl)pyridin-2-yl)-4,4'-bipiperidine | CHEMBL1771092
Type:
Small organic molecule
Emp. Form.:
C23H28F3N3O2S
Mol. Mass.:
467.548
SMILES:
CS(=O)(=O)c1ccc(cc1)N1CCC(CC1)C1CCN(CC1)c1ccc(cn1)C(F)(F)F
: