Target
Glucose-dependent insulinotropic receptor
Ligand
BDBM50342693
Substrate
Meas. Tech.
ChEMBL_745194 (CHEMBL1772425)
EC50
10±n/a nM
Citation
 Szewczyk, JWActon, JAdams, ADChicchi, GFreeman, SHoward, ADHuang, YLi, CMeinke, PTMosely, RMurphy, ESamuel, RSantini, CYang, MZhang, YZhao, KWood, HB Design of potent and selective GPR119 agonists for type II diabetes. Bioorg Med Chem Lett 21:2665-9 (2011)  
Target
Name:
Glucose-dependent insulinotropic receptor
Synonyms:
GP119_MOUSE | Gpr119
Type:
PROTEIN
Mol. Mass.:
37009.07
Organism:
Mus musculus
Description:
ChEMBL_1506420
Residue:
335
  
Inhibitor
Name:
BDBM50342693
Synonyms:
2-methyl-6-(1'-(5-methylpyrimidin-2-yl)-4,4'-bipiperidin-1-yl)pyrimidine-4-carbonitrile | CHEMBL1771094
Type:
Small organic molecule
Emp. Form.:
C21H27N7
Mol. Mass.:
377.486
SMILES:
Cc1cnc(nc1)N1CCC(CC1)C1CCN(CC1)c1cc(nc(C)n1)C#N
: