Target
Potassium voltage-gated channel subfamily H member 2
Ligand
BDBM50342697
Substrate
Meas. Tech.
ChEMBL_744146 (CHEMBL1771845)
IC50
>30000±n/a nM
Citation
 Szewczyk, JWActon, JAdams, ADChicchi, GFreeman, SHoward, ADHuang, YLi, CMeinke, PTMosely, RMurphy, ESamuel, RSantini, CYang, MZhang, YZhao, KWood, HB Design of potent and selective GPR119 agonists for type II diabetes. Bioorg Med Chem Lett 21:2665-9 (2011)  
Target
Name:
Potassium voltage-gated channel subfamily H member 2
Synonyms:
1,3-beta-glucan synthase component GLS2 ERG Eag-related protein 1 Ether-a-go-go-related gene (HERG) Ether-a-go-go-related gene potassium channel 1 Ether-a-go-go-related gene potassium channel 1 (hERG1) Ether-a-go-go-related protein 1 H-ERG KCNH2 Potassium voltage-gated channel subfamily H member 2 (hERG) Voltage-gated potassium channel subunit Kv11.1 hERG Potassium Channel 1 | putative potassium channel subunit
Type:
Multi-pass membrane protein
Mol. Mass.:
126672.65
Organism:
Homo sapiens (Human)
Description:
Q12809
Residue:
1159
  
Inhibitor
Name:
BDBM50342697
Synonyms:
(+)-trans-4-(2-(2-(1-(5-chloropyrimidin-2-yl)piperidin-4-yl)cyclopropyl)ethoxy)-N-cyclopropyl-2-fluorobenzamide (rac)-cis-4-(2-(2-(1-(5-chloropyrimidin-2-yl)piperidin-4-yl)cyclopropyl)ethoxy)-N-cyclopropyl-2-fluorobenzamide | CHEMBL1771098
Type:
Small organic molecule
Emp. Form.:
C24H28ClFN4O2
Mol. Mass.:
458.956
SMILES:
Fc1cc(OCCC2CC2C2CCN(CC2)c2ncc(Cl)cn2)ccc1C(=O)NC1CC1
: