Target
D(3) dopamine receptor
Ligand
BDBM50342710
Substrate
Meas. Tech.
ChEMBL_744158 (CHEMBL1771857)
Ki
0.27±n/a nM
Citation
 Ortega, RHübner, HGmeiner, PMasaguer, CF Aromatic ring functionalization of benzolactam derivatives: new potent dopamine D3 receptor ligands. Bioorg Med Chem Lett 21:2670-4 (2011)  
Target
Name:
D(3) dopamine receptor
Synonyms:
DOPAMINE D3 DRD3_HUMAN Dopamine D3 receptor (D3) Dopamine receptor Dopamine receptor D3
Type:
Mol. Mass.:
44243.43
Organism:
Homo sapiens (Human)
Description:
Residue:
400
  
Inhibitor
Name:
BDBM50342710
Synonyms:
2-(4-(4-(2-methoxyphenyl)piperazin-1-yl)butyl)-2,3,4,5-tetrahydro-1H-benzo[c]azepin-1-one | CHEMBL477206
Type:
Small organic molecule
Emp. Form.:
C25H33N3O2
Mol. Mass.:
407.5484
SMILES:
COc1ccccc1N1CCN(CCCCN2CCCc3ccccc3C2=O)CC1
: