Target
Prostaglandin G/H synthase 1
Ligand
BDBM50342804
Substrate
Meas. Tech.
ChEMBL_744565 (CHEMBL1772586)
IC50
>100000±n/a nM
Citation
 Abdel-Aziz, AAElTahir, KEAsiri, YA Synthesis, anti-inflammatory activity and COX-1/COX-2 inhibition of novel substituted cyclic imides. Part 1: Molecular docking study. Eur J Med Chem 46:1648-55 (2011)  
Target
Name:
Prostaglandin G/H synthase 1
Synonyms:
COX1 Cyclooxygenase-1 (COX-1) PTGS1 | Prostaglandin G/H synthase (cyclooxygenase)
Type:
Protein
Mol. Mass.:
68868.60
Organism:
Ovis aries (Sheep)
Description:
Residue:
600
  
Inhibitor
Name:
BDBM50342804
Synonyms:
5-tert-Butyl-2-(3,4,5-trichlorophenyl)isoindoline-1,3-dione | CHEMBL1770590
Type:
Small organic molecule
Emp. Form.:
C18H14Cl3NO2
Mol. Mass.:
382.668
SMILES:
CC(C)(C)c1ccc2C(=O)N(C(=O)c2c1)c1cc(Cl)c(Cl)c(Cl)c1
: