Target
Prostaglandin G/H synthase 2
Ligand
BDBM50342795
Substrate
Meas. Tech.
ChEMBL_744566 (CHEMBL1772587)
IC50
5200±n/a nM
Citation
 Abdel-Aziz, AAElTahir, KEAsiri, YA Synthesis, anti-inflammatory activity and COX-1/COX-2 inhibition of novel substituted cyclic imides. Part 1: Molecular docking study. Eur J Med Chem 46:1648-55 (2011)  
Target
Name:
Prostaglandin G/H synthase 2
Synonyms:
COX2 Cyclooxygenase-2 (COX-2) PTGS2 Prostaglandin G/H synthase (cyclooxygenase)
Type:
Protein
Mol. Mass.:
68976.98
Organism:
Ovis aries (Sheep)
Description:
Residue:
603
  
Inhibitor
Name:
BDBM50342795
Synonyms:
6-(3,4,5-trimethoxyphenyl)-5H-pyrrolo[3,4-b]pyrazine-5,7(6H)-dione | CHEMBL1770581
Type:
Small organic molecule
Emp. Form.:
C15H13N3O5
Mol. Mass.:
315.2808
SMILES:
COc1cc(cc(OC)c1OC)N1C(=O)c2nccnc2C1=O
: