Target
Prostaglandin G/H synthase 2
Ligand
BDBM50342814
Substrate
Meas. Tech.
ChEMBL_744566 (CHEMBL1772587)
IC50
1000±n/a nM
Citation
 Abdel-Aziz, AAElTahir, KEAsiri, YA Synthesis, anti-inflammatory activity and COX-1/COX-2 inhibition of novel substituted cyclic imides. Part 1: Molecular docking study. Eur J Med Chem 46:1648-55 (2011)  
Target
Name:
Prostaglandin G/H synthase 2
Synonyms:
COX2 Cyclooxygenase-2 (COX-2) PTGS2 Prostaglandin G/H synthase (cyclooxygenase)
Type:
Protein
Mol. Mass.:
68976.98
Organism:
Ovis aries (Sheep)
Description:
Residue:
603
  
Inhibitor
Name:
BDBM50342814
Synonyms:
6-(3,4,5-Trichlorophenyl)-5H-dibenzo[c,e]azepine-5,7(6H)-dione | CHEMBL1770599
Type:
Small organic molecule
Emp. Form.:
C20H10Cl3NO2
Mol. Mass.:
402.658
SMILES:
Clc1cc(cc(Cl)c1Cl)-n1c(=O)c2ccccc2c2ccccc2c1=O
: