Target
Solute carrier family 5 member 4
Ligand
BDBM50342888
Substrate
Meas. Tech.
ChEMBL_745217 (CHEMBL1772493)
IC50
1.11±n/a nM
Citation
 Mascitti, VMaurer, TSRobinson, RPBian, JBoustany-Kari, CMBrandt, TCollman, BMKalgutkar, ASKlenotic, MKLeininger, MTLowe, AMaguire, RJMasterson, VMMiao, ZMukaiyama, EPatel, JDPettersen, JCPréville, CSamas, BShe, LSobol, ZSteppan, CMStevens, BDThuma, BATugnait, MZeng, DZhu, T Discovery of a clinical candidate from the structurally unique dioxa-bicyclo[3.2.1]octane class of sodium-dependent glucose cotransporter 2 inhibitors. J Med Chem 54:2952-60 (2011)  
Target
Name:
Solute carrier family 5 member 4
Synonyms:
Low affinity sodium-glucose cotransporter SAAT1 SGLT3 Sodium/glucose cotransporter 3 | Solute carrier family 5 member 4
Type:
PROTEIN
Mol. Mass.:
72452.26
Organism:
Homo sapiens (Human)
Description:
ChEMBL_764617
Residue:
659
  
Inhibitor
Name:
BDBM50342888
Synonyms:
(1S,2S,3S,4R,5S)-5-[3-(4-Ethoxybenzyl)-4-methylphenyl]-1-(hydroxymethyl)-6,8-dioxa-bicyclo[3.2.1]octane-2,3,4-triol | CHEMBL1770245
Type:
Small organic molecule
Emp. Form.:
C23H28O7
Mol. Mass.:
416.4642
SMILES:
CCOc1ccc(Cc2cc(ccc2C)[C@]23OC[C@](CO)(O2)[C@@H](O)[C@H](O)[C@H]3O)cc1
: