Target
Dual specificity protein kinase CLK3
Ligand
BDBM50342894
Substrate
Meas. Tech.
ChEMBL_744229 (CHEMBL1772036)
IC50
>10000±n/a nM
Citation
 Rosenthal, ASTanega, CShen, MMott, BTBougie, JMNguyen, DTMisteli, TAuld, DSMaloney, DJThomas, CJ Potent and selective small molecule inhibitors of specific isoforms of Cdc2-like kinases (Clk) and dual specificity tyrosine-phosphorylation-regulated kinases (Dyrk). Bioorg Med Chem Lett 21:3152-8 (2011)  
Target
Name:
Dual specificity protein kinase CLK3
Synonyms:
CDC2-like kinase 3 (CLK3) CLK3_HUMAN | Dual specificity protein kinase CLK3
Type:
Protein
Mol. Mass.:
73570.11
Organism:
Homo sapiens (Human)
Description:
Residue:
638
  
Inhibitor
Name:
BDBM50342894
Synonyms:
CHEMBL1515868 | N-(2-(1H-imidazol-4-yl)ethyl)-6-(benzo[d][1,3]dioxol-5-yl)quinazolin-4-amine
Type:
Small organic molecule
Emp. Form.:
C20H17N5O2
Mol. Mass.:
359.3813
SMILES:
C(Cc1cnc[nH]1)Nc1ncnc2ccc(cc12)-c1ccc2OCOc2c1
: