Target
Dual specificity protein kinase CLK4
Ligand
BDBM50342916
Substrate
Meas. Tech.
ChEMBL_744201 (CHEMBL1771958)
IC50
11±n/a nM
Citation
 Rosenthal, ASTanega, CShen, MMott, BTBougie, JMNguyen, DTMisteli, TAuld, DSMaloney, DJThomas, CJ Potent and selective small molecule inhibitors of specific isoforms of Cdc2-like kinases (Clk) and dual specificity tyrosine-phosphorylation-regulated kinases (Dyrk). Bioorg Med Chem Lett 21:3152-8 (2011)  
Target
Name:
Dual specificity protein kinase CLK4
Synonyms:
CDC-like kinase 4 CLK4_HUMAN | Dual specificity protein kinase CLK1/CLK4
Type:
Serine/threonine-protein kinase
Mol. Mass.:
57522.53
Organism:
Homo sapiens (Human)
Description:
gi_10190706
Residue:
481
  
Inhibitor
Name:
BDBM50342916
Synonyms:
6-(benzo[d][1,3]dioxol-5-yl)-N-methyl-N-((2-methylthiazol-4-yl)methyl)quinazolin-4-amine | CHEMBL1474834
Type:
Small organic molecule
Emp. Form.:
C21H18N4O2S
Mol. Mass.:
390.458
SMILES:
CN(Cc1csc(C)n1)c1ncnc2ccc(cc12)-c1ccc2OCOc2c1
: