Target
Dual specificity tyrosine-phosphorylation-regulated kinase 1A
Ligand
BDBM50342916
Substrate
Meas. Tech.
ChEMBL_744200 (CHEMBL1771957)
IC50
14±n/a nM
Citation
 Rosenthal, ASTanega, CShen, MMott, BTBougie, JMNguyen, DTMisteli, TAuld, DSMaloney, DJThomas, CJ Potent and selective small molecule inhibitors of specific isoforms of Cdc2-like kinases (Clk) and dual specificity tyrosine-phosphorylation-regulated kinases (Dyrk). Bioorg Med Chem Lett 21:3152-8 (2011)  
Target
Name:
Dual specificity tyrosine-phosphorylation-regulated kinase 1A
Synonyms:
DYR1A_HUMAN DYRK1A Dual specificity YAK1-related kinase 1A (Dyrk1A) Dual-specificity tyrosine-phosphorylation regulated kinase 1A HP86 MNBH
Type:
Enzyme
Mol. Mass.:
85616.61
Organism:
Homo sapiens (Human)
Description:
Q13627
Residue:
763
  
Inhibitor
Name:
BDBM50342916
Synonyms:
6-(benzo[d][1,3]dioxol-5-yl)-N-methyl-N-((2-methylthiazol-4-yl)methyl)quinazolin-4-amine | CHEMBL1474834
Type:
Small organic molecule
Emp. Form.:
C21H18N4O2S
Mol. Mass.:
390.458
SMILES:
CN(Cc1csc(C)n1)c1ncnc2ccc(cc12)-c1ccc2OCOc2c1
: