Target
Ribonuclease HI
Ligand
BDBM50343047
Substrate
Meas. Tech.
ChEMBL_744865 (CHEMBL1772886)
IC50
>20000±n/a nM
Citation
 Kim, JAYang, SYWamiru, AMcMahon, JBLe Grice, SFBeutler, JAKim, YH New monoterpene glycosides and phenolic compounds from Distylium racemosum and their inhibitory activity against ribonuclease H. Bioorg Med Chem Lett 21:2840-4 (2011)  
Target
Name:
Ribonuclease HI
Synonyms:
RNH_ECOLI Ribonuclease H dasF rnh sdrA
Type:
Enzyme
Mol. Mass.:
17601.33
Organism:
Escherichia coli (strain K12)
Description:
Residue:
155
  
Inhibitor
Name:
BDBM50343047
Synonyms:
CHEMBL1770694 | iso-dihydrodendranthemoside A
Type:
Small organic molecule
Emp. Form.:
C19H36O8
Mol. Mass.:
392.4843
SMILES:
C[C@H](O)CC[C@@]1(O)[C@@H](C)C[C@@H](CC1(C)C)O[C@H]1O[C@@H](CO)[C@H](O)[C@@H](O)[C@@H]1O
: