Target
Muscarinic acetylcholine receptor M3
Ligand
BDBM50343155
Substrate
Meas. Tech.
ChEMBL_745281 (CHEMBL1775313)
Ki
6.1±n/a nM
Citation
 Jones, LHBaldock, HBunnage, MEBurrows, JClarke, NCoghlan, MEntwistle, DFairman, DFeeder, NFulton, CHilton, LJames, KJones, RMKenyon, ASMarshall, SNewman, SDOsborne, RPatel, SSelby, MDStuart, EFTrevethick, MAWright, KNPrice, DA Inhalation by design: dual pharmacology β-2 agonists/M3 antagonists for the treatment of COPD. Bioorg Med Chem Lett 21:2759-63 (2011)  
Target
Name:
Muscarinic acetylcholine receptor M3
Synonyms:
ACM3_HUMAN Cholinergic, muscarinic M3 Muscarinic receptor M3 | RecName: Full=Muscarinic acetylcholine receptor M3
Type:
Enzyme
Mol. Mass.:
66151.03
Organism:
Homo sapiens (Human)
Description:
P20309
Residue:
590
  
Inhibitor
Name:
BDBM50343155
Synonyms:
CHEMBL1773262 | N-(5-((R)-2-(3-((R)-3-(diisopropylamino)-1-phenylpropyl)-4-hydroxyphenethylamino)-1-hydroxyethyl)-2-hydroxyphenyl)methanesulfonamide
Type:
Small organic molecule
Emp. Form.:
C32H45N3O5S
Mol. Mass.:
583.782
SMILES:
CC(C)N(CC[C@H](c1ccccc1)c1cc(CCNC[C@H](O)c2ccc(O)c(NS(C)(=O)=O)c2)ccc1O)C(C)C
: