Target
Heat shock protein HSP 90
Ligand
BDBM20732
Substrate
Meas. Tech.
ChEMBL_745420 (CHEMBL1775576)
IC50
2000±n/a nM
Citation
 Zhao, HBrandt, GEGalam, LMatts, RLBlagg, BS Identification and initial SAR of silybin: an Hsp90 inhibitor. Bioorg Med Chem Lett 21:2659-64 (2011)  
Target
Name:
Heat shock protein HSP 90
Synonyms:
Eukaryotic peptide initiation factor 2 kinase, alpha-chain-associated phosphopeptide | HSP90_RABIT
Type:
PROTEIN
Mol. Mass.:
5288.84
Organism:
Oryctolagus cuniculus
Description:
ChEMBL_1448528
Residue:
47
  
Inhibitor
Name:
BDBM20732
Synonyms:
(4E,6Z,8S,9S,10E,12S,13R,14S,16R)-13-hydroxy-8,14,19-trimethoxy-4,10,12,16-tetramethyl-3,20,22-trioxo-2-azabicyclo[16.3.1]docosa-1(21),4,6,10,18-pentaen-9-yl carbamate CHEMBL278315 Geldanamycin | geldanomycin
Type:
Emp. Form.:
C29H40N2O9
Mol. Mass.:
560.6359
SMILES:
CO[C@H]1CC(C)=Cc2c(O)c(NC(=O)C(C)=CC=C[C@H](OC)[C@@H](OC(N)=O)\C(C)=C\[C@H](C)[C@H]1O)cc(O)c2OC
: