Target
D(2) dopamine receptor
Ligand
BDBM50343259
Substrate
Meas. Tech.
ChEMBL_745646 (CHEMBL1776016)
Ki
2.6±n/a nM
Citation
 Johnson, DSChoi, CFay, LKFavor, DARepine, JTWhite, ADAkunne, HCFitzgerald, LNicholls, KSnyder, BJWhetzel, SZZhang, LSerpa, KA Discovery of PF-00217830: aryl piperazine napthyridinones as D2 partial agonists for schizophrenia and bipolar disorder. Bioorg Med Chem Lett 21:2621-5 (2011)  
Target
Name:
D(2) dopamine receptor
Synonyms:
D(2) dopamine receptor DOPAMINE D2 Long DRD2 Dopamine D2 receptor Dopamine D2 receptor (D2R) Dopamine2-like | d2
Type:
Cell-surface receptors
Mol. Mass.:
50647.10
Organism:
Homo sapiens (Human)
Description:
P14416
Residue:
443
  
Inhibitor
Name:
BDBM50343259
Synonyms:
7-(5-(4-(2,3-dichlorophenyl)piperazin-1-yl)pentyl)-3,4-dihydro-1,8-naphthyridin-2(1H)-one | CHEMBL1774062
Type:
Small organic molecule
Emp. Form.:
C23H28Cl2N4O
Mol. Mass.:
447.401
SMILES:
Clc1cccc(N2CCN(CCCCCc3ccc4CCC(=O)Nc4n3)CC2)c1Cl
: