Target
D(2) dopamine receptor
Ligand
BDBM50343282
Substrate
Meas. Tech.
ChEMBL_745646 (CHEMBL1776016)
Ki
1±n/a nM
Citation
 Johnson, DSChoi, CFay, LKFavor, DARepine, JTWhite, ADAkunne, HCFitzgerald, LNicholls, KSnyder, BJWhetzel, SZZhang, LSerpa, KA Discovery of PF-00217830: aryl piperazine napthyridinones as D2 partial agonists for schizophrenia and bipolar disorder. Bioorg Med Chem Lett 21:2621-5 (2011)  
Target
Name:
D(2) dopamine receptor
Synonyms:
D(2) dopamine receptor DOPAMINE D2 Long DRD2 Dopamine D2 receptor Dopamine D2 receptor (D2R) Dopamine2-like | d2
Type:
Cell-surface receptors
Mol. Mass.:
50647.10
Organism:
Homo sapiens (Human)
Description:
P14416
Residue:
443
  
Inhibitor
Name:
BDBM50343282
Synonyms:
7-(4-(4-(6-fluoronaphthalen-1-yl)piperazin-1-yl)butoxy)-3,4-dihydro-1,8-naphthyridin-2(1H)-one | CHEMBL1774085
Type:
Small organic molecule
Emp. Form.:
C26H29FN4O2
Mol. Mass.:
448.5325
SMILES:
Fc1ccc2c(cccc2c1)N1CCN(CCCCOc2ccc3CCC(=O)Nc3n2)CC1
: