Target
5-hydroxytryptamine receptor 2A
Ligand
BDBM50343280
Substrate
Meas. Tech.
ChEMBL_745648 (CHEMBL1776018)
Ki
11.7±n/a nM
Citation
 Johnson, DSChoi, CFay, LKFavor, DARepine, JTWhite, ADAkunne, HCFitzgerald, LNicholls, KSnyder, BJWhetzel, SZZhang, LSerpa, KA Discovery of PF-00217830: aryl piperazine napthyridinones as D2 partial agonists for schizophrenia and bipolar disorder. Bioorg Med Chem Lett 21:2621-5 (2011)  
Target
Name:
5-hydroxytryptamine receptor 2A
Synonyms:
5-HT-2 5-HT2A 5-hydroxytryptamine receptor 2A (5HT-2A) 5HT2A_HUMAN HTR2A | Serotonin receptor 2A
Type:
undefined
Mol. Mass.:
52607.65
Organism:
Homo sapiens (Human)
Description:
P28223
Residue:
471
  
Inhibitor
Name:
BDBM50343280
Synonyms:
7-(4-(4-(4-fluoronaphthalen-1-yl)piperazin-1-yl)butoxy)-3,4-dihydro-1,8-naphthyridin-2(1H)-one | CHEMBL1774083
Type:
Small organic molecule
Emp. Form.:
C26H29FN4O2
Mol. Mass.:
448.5325
SMILES:
Fc1ccc(N2CCN(CCCCOc3ccc4CCC(=O)Nc4n3)CC2)c2ccccc12
: