Target
HTH-type transcriptional regulator EthR
Ligand
BDBM50343348
Substrate
Meas. Tech.
ChEMBL_745892 (CHEMBL1776262)
IC50
1500±n/a nM
Citation
 Flipo, MDesroses, MLecat-Guillet, NDirié, BCarette, XLeroux, FPiveteau, CDemirkaya, FLens, ZRucktooa, PVilleret, VChristophe, TJeon, HKLocht, CBrodin, PDéprez, BBaulard, ARWilland, N Ethionamide boosters: synthesis, biological activity, and structure-activity relationships of a series of 1,2,4-oxadiazole EthR inhibitors. J Med Chem 54:2994-3010 (2011)  
Target
Name:
HTH-type transcriptional regulator EthR
Synonyms:
ETHR_MYCTU Transcriptional repressor EthR (EthR) ethR
Type:
Protein
Mol. Mass.:
23751.94
Organism:
Mycobacterium tuberculosis
Description:
P9WMC1
Residue:
216
  
Inhibitor
Name:
BDBM50343348
Synonyms:
2-Cyclopentyl-1-[4-(3-thiophen-2-yl-[1,2,4]oxadiazol-5-yl)-piperidin-1-yl]-ethanone | CHEMBL1773961
Type:
Small organic molecule
Emp. Form.:
C18H23N3O2S
Mol. Mass.:
345.459
SMILES:
O=C(CC1CCCC1)N1CCC(CC1)c1nc(no1)-c1cccs1
: