Target
Uracil-DNA glycosylase
Ligand
BDBM50343397
Substrate
Meas. Tech.
ChEMBL_747132 (CHEMBL1777498)
IC50
>200000±n/a nM
Citation
 Nuth, MHuang, LSaw, YLSchormann, NChattopadhyay, DRicciardi, RP Identification of inhibitors that block vaccinia virus infection by targeting the DNA synthesis processivity factor D4. J Med Chem 54:3260-7 (2011)  
Target
Name:
Uracil-DNA glycosylase
Synonyms:
OPG116 UNG | UNG_VACCW
Type:
PROTEIN
Mol. Mass.:
25071.48
Organism:
Vaccinia virus (strain Western Reserve) (VACV) (Vaccinia virus (strainWR))
Description:
ChEMBL_747132
Residue:
218
  
Inhibitor
Name:
BDBM50343397
Synonyms:
CHEMBL1358481 | N2,N4-bis(2,4-dimethoxyphenyl)-6-morpholino-1,3,5-triazine-2,4-diamine
Type:
Small organic molecule
Emp. Form.:
C23H28N6O5
Mol. Mass.:
468.5056
SMILES:
COc1ccc(Nc2nc(Nc3ccc(OC)cc3OC)nc(n2)N2CCOCC2)c(OC)c1
: