Target
Uracil-DNA glycosylase
Ligand
BDBM50343411
Substrate
Meas. Tech.
ChEMBL_747132 (CHEMBL1777498)
IC50
175300±n/a nM
Citation
 Nuth, MHuang, LSaw, YLSchormann, NChattopadhyay, DRicciardi, RP Identification of inhibitors that block vaccinia virus infection by targeting the DNA synthesis processivity factor D4. J Med Chem 54:3260-7 (2011)  
Target
Name:
Uracil-DNA glycosylase
Synonyms:
OPG116 UNG | UNG_VACCW
Type:
PROTEIN
Mol. Mass.:
25071.48
Organism:
Vaccinia virus (strain Western Reserve) (VACV) (Vaccinia virus (strainWR))
Description:
ChEMBL_747132
Residue:
218
  
Inhibitor
Name:
BDBM50343411
Synonyms:
CHEMBL1488419 | N-(2-methoxy-5-methylphenyl)-4-methyl-N-(2-(4-methylpiperidin-1-yl)-2-oxoethyl)benzenesulfonamide
Type:
Small organic molecule
Emp. Form.:
C23H30N2O4S
Mol. Mass.:
430.56
SMILES:
COc1ccc(C)cc1N(CC(=O)N1CCC(C)CC1)S(=O)(=O)c1ccc(C)cc1
: