Target
Baculoviral IAP repeat-containing protein 3
Ligand
BDBM50343516
Substrate
Meas. Tech.
ChEMBL_746856 (CHEMBL1777139)
IC50
14±n/a nM
Citation
 Sun, HLiu, LLu, JBai, LLi, XNikolovska-Coleska, ZMcEachern, DYang, CYQiu, SYi, HSun, DWang, S Potent bivalent Smac mimetics: effect of the linker on binding to inhibitor of apoptosis proteins (IAPs) and anticancer activity. J Med Chem 54:3306-18 (2011)  
Target
Name:
Baculoviral IAP repeat-containing protein 3
Synonyms:
API2 BIRC3_HUMAN Baculoviral IAP repeat-containing protein 3 (IAP1 BIR3) MIHC XIAP-BIR3 | cIAP1/cIAP2
Type:
Protein
Mol. Mass.:
68365.75
Organism:
Homo sapiens (Human)
Description:
Q13489
Residue:
604
  
Inhibitor
Name:
BDBM50343516
Synonyms:
(S,3S,3'S,6S,6'S,1'aS,1'a'S)-N,N'-((1S,1'S)-(1,1'-((Carbonylbis(azanediyl))bis(butane-4,1-diyl))bis(1H-1,2,3-triazole-4,1-diyl))bis(phenylmethylene))bis(6-((S)-2-(methylamino)propanamido)-5-oxodecahydropyrrolo[1,2-a]azocine-3-carboxamide) | CHEMBL1774162
Type:
Small organic molecule
Emp. Form.:
C57H82N16O7
Mol. Mass.:
1103.364
SMILES:
CN[C@@H](C)C(=O)N[C@H]1CCCC[C@H]2CC[C@H](N2C1=O)C(=O)N[C@H](c1cn(CCCCNC(=O)NCCCCn2cc(nn2)[C@@H](NC(=O)[C@@H]2CC[C@@H]3CCCC[C@H](NC(=O)[C@H](C)NC)C(=O)N23)c2ccccc2)nn1)c1ccccc1
: