Target
Melatonin receptor type 1B
Ligand
BDBM50343602
Substrate
Meas. Tech.
ChEMBL_746050 (CHEMBL1775437)
Ki
0.012±n/a nM
Citation
 Koike, THoashi, YTakai, TNakayama, MYukuhiro, NIshikawa, THirai, KUchikawa, O 1,6-Dihydro-2H-indeno[5,4-b]furan derivatives: design, synthesis, and pharmacological characterization of a novel class of highly potent MT2-selective agonists. J Med Chem 54:3436-44 (2011)  
Target
Name:
Melatonin receptor type 1B
Synonyms:
MTNR1B Mel-1B-R Melatonin 1B Melatonin receptor type 1B | Melatonin receptor type 2 (MT2)
Type:
Enzyme
Mol. Mass.:
40203.54
Organism:
Homo sapiens (Human)
Description:
P49286
Residue:
362
  
Inhibitor
Name:
BDBM50343602
Synonyms:
CHEMBL1774519 | N-{2-[7-(Cyclohexylmethyl)-1,6-dihydro-2H-indeno[5,4-b]-furan-8-yl]ethyl}acetamide
Type:
Small organic molecule
Emp. Form.:
C22H29NO2
Mol. Mass.:
339.4712
SMILES:
CC(=O)NCCC1=C(CC2CCCCC2)Cc2ccc3OCCc3c12
: