Target
Mu-type opioid receptor
Ligand
BDBM50135808
Substrate
Meas. Tech.
ChEMBL_746793 (CHEMBL1777023)
Ki
0.230000±n/a nM
Citation
 Zhang, BZhang, TSromek, AWScrimale, TBidlack, JMNeumeyer, JL Synthesis and binding affinity of novel mono- and bivalent morphinan ligands for κ, μ, and δ opioid receptors. Bioorg Med Chem 19:2808-16 (2011)  
Target
Name:
Mu-type opioid receptor
Synonyms:
M-OR-1 MOR-1 MUOR1 Mu opiate receptor OPRM1 hMOP | mu-type opioid receptor isoform MOR-1
Type:
G Protein-Coupled Receptor (GPCR)
Mol. Mass.:
44789.51
Organism:
Homo sapiens (Human)
Description:
P35372
Residue:
400
  
Inhibitor
Name:
BDBM50135808
Synonyms:
(-)-3-Hydroxy-N-cyclobutylmethylmorphinan S(+)-Mandelate 3-Hydroxy-N-cyclobutylmethylmorphinan CHEMBL301160 | MCL-101
Type:
Small organic molecule
Emp. Form.:
C21H29NO
Mol. Mass.:
311.4611
SMILES:
Oc1ccc2C[C@@H]3[C@@H]4CCCC[C@]4(CCN3CC3CCC3)c2c1
: