Target
Tyrosine-protein kinase JAK2
Ligand
BDBM50343723
Substrate
Meas. Tech.
ChEMBL_746713 (CHEMBL1776838)
IC50
3±n/a nM
Citation
 Wang, TIoannidis, SAlmeida, LBlock, MHDavies, AMLamb, MLScott, DASu, MZhang, HJAlimzhanov, MBebernitz, GBell, KZinda, M In vitro and in vivo evaluation of 6-aminopyrazolyl-pyridine-3-carbonitriles as JAK2 kinase inhibitors. Bioorg Med Chem Lett 21:2958-61 (2011)  
Target
Name:
Tyrosine-protein kinase JAK2
Synonyms:
JAK-2 JAK2_HUMAN Janus kinase 2 (JAK2) | Janus kinase 2 (a protein tyrosine kinase)
Type:
Protein
Mol. Mass.:
130684.68
Organism:
Homo sapiens (Human)
Description:
O60674
Residue:
1132
  
Inhibitor
Name:
BDBM50343723
Synonyms:
(S)-6-(5-cyclopropyl-1H-pyrazol-3-ylamino)-5-fluoro-2-(1-(4-fluorophenyl)ethylamino)nicotinonitrile | CHEMBL1774053
Type:
Small organic molecule
Emp. Form.:
C20H18F2N6
Mol. Mass.:
380.3939
SMILES:
C[C@H](Nc1nc(Nc2cc(n[nH]2)C2CC2)c(F)cc1C#N)c1ccc(F)cc1
: