Target
Sphingosine kinase 1
Ligand
BDBM50299323
Substrate
Meas. Tech.
ChEMBL_747639 (CHEMBL1777257)
Ki
1400±n/a nM
Citation
 Kennedy, AJMathews, TPKharel, YField, SDMoyer, MLEast, JEHouck, JDLynch, KRMacdonald, TL Development of amidine-based sphingosine kinase 1 nanomolar inhibitors and reduction of sphingosine 1-phosphate in human leukemia cells. J Med Chem 54:3524-48 (2011)  
Target
Name:
Sphingosine kinase 1
Synonyms:
SK1 SPHK1 SPK Sphingosine kinase 1 (SPHK1) | Sphingosine kinase types 1 (SphK1)
Type:
Enzyme
Mol. Mass.:
42521.16
Organism:
Homo sapiens (Human)
Description:
Q9NYA1
Residue:
384
  
Inhibitor
Name:
BDBM50299323
Synonyms:
(S)-2-amino-4-hydroxy-N-(4-octylphenyl)butanamide | CHEMBL583979
Type:
Small organic molecule
Emp. Form.:
C18H30N2O2
Mol. Mass.:
306.443
SMILES:
CCCCCCCCc1ccc(NC(=O)[C@@H](N)CCO)cc1
: