Target
Sphingosine kinase 2
Ligand
BDBM50343819
Substrate
Meas. Tech.
ChEMBL_747638 (CHEMBL1777256)
Ki
>20000±n/a nM
Citation
 Kennedy, AJMathews, TPKharel, YField, SDMoyer, MLEast, JEHouck, JDLynch, KRMacdonald, TL Development of amidine-based sphingosine kinase 1 nanomolar inhibitors and reduction of sphingosine 1-phosphate in human leukemia cells. J Med Chem 54:3524-48 (2011)  
Target
Name:
Sphingosine kinase 2
Synonyms:
SK 2 SPK 2 Sphingosine kinase 2 (SPHK2) | Sphk2
Type:
Enzyme
Mol. Mass.:
65617.92
Organism:
Mus musculus (Mouse)
Description:
Q9JIA7
Residue:
617
  
Inhibitor
Name:
BDBM50343819
Synonyms:
1-Carbamimidoyl-N-(4-(8-(cyclohexylmethoxy)octyl)phenyl)cyclopropanecarboxamide Hydrochloride | CHEMBL1774561
Type:
Small organic molecule
Emp. Form.:
C26H41N3O2
Mol. Mass.:
427.6226
SMILES:
NC(=N)C1(CC1)C(=O)Nc1ccc(CCCCCCCCOCC2CCCCC2)cc1
: