Target
Sphingosine kinase 2
Ligand
BDBM50343832
Substrate
Meas. Tech.
ChEMBL_747638 (CHEMBL1777256)
Ki
5300±n/a nM
Citation
 Kennedy, AJMathews, TPKharel, YField, SDMoyer, MLEast, JEHouck, JDLynch, KRMacdonald, TL Development of amidine-based sphingosine kinase 1 nanomolar inhibitors and reduction of sphingosine 1-phosphate in human leukemia cells. J Med Chem 54:3524-48 (2011)  
Target
Name:
Sphingosine kinase 2
Synonyms:
SK 2 SPK 2 Sphingosine kinase 2 (SPHK2) | Sphk2
Type:
Enzyme
Mol. Mass.:
65617.92
Organism:
Mus musculus (Mouse)
Description:
Q9JIA7
Residue:
617
  
Inhibitor
Name:
BDBM50343832
Synonyms:
(S)-1-(4-(9-cyclohexylnonyl)benzoyl)pyrrolidine-2-carboximidamide hydrochloride | CHEMBL1774574
Type:
Small organic molecule
Emp. Form.:
C27H43N3O
Mol. Mass.:
425.6498
SMILES:
NC(=N)[C@@H]1CCCN1C(=O)c1ccc(CCCCCCCCCC2CCCCC2)cc1
: