Target
Histamine H3 receptor
Ligand
BDBM22911
Substrate
Meas. Tech.
ChEMBL_747323 (CHEMBL1776626)
Ki
0.7±n/a nM
Citation
 Wiecek, MKottke, TLigneau, XSchunack, WSeifert, RStark, HHandzlik, JKiec-Kononowicz, K N-Alkenyl and cycloalkyl carbamates as dual acting histamine H3 and H4 receptor ligands. Bioorg Med Chem 19:2850-8 (2011)  
Target
Name:
Histamine H3 receptor
Synonyms:
G-protein coupled receptor 97 HH3R HRH3 Histamine H3 receptor (H3) Histamine receptor (H3 and H4)
Type:
G Protein-Coupled Receptor (GPCR)
Mol. Mass.:
48691.47
Organism:
Homo sapiens (Human)
Description:
Binding assays were using CHO cells stably expressing hH3R receptors.
Residue:
445
  
Inhibitor
Name:
BDBM22911
Synonyms:
2-(3H-imidazol-4-yl)ethylsulfanylmethanimidamide CHEMBL544911 {[2-(1H-imidazol-4-yl)ethyl]sulfanyl}methanimidamide
Type:
Small organic molecule
Emp. Form.:
C6H10N4S
Mol. Mass.:
170.235
SMILES:
NC(=N)SCCc1cnc[nH]1
: