Target
P2Y purinoceptor 14
Ligand
BDBM50343873
Substrate
Meas. Tech.
ChEMBL_747401 (CHEMBL1776795)
IC50
2100±n/a nM
Citation
 Gauthier, JYBelley, MDeschênes, DFournier, JFGagné, SGareau, YHamel, MHénault, MHyjazie, HKargman, SLavallée, GLevesque, JFLi, LMamane, YMancini, JMorin, NMulrooney, ERobichaud, JThérien, MTranmer, GWang, ZWu, JBlack, WC The identification of 4,7-disubstituted naphthoic acid derivatives as UDP-competitive antagonists of P2Y14. Bioorg Med Chem Lett 21:2836-9 (2011)  
Target
Name:
P2Y purinoceptor 14
Synonyms:
G-protein coupled receptor 105 P2Y14 P2ry14 | UDP-glucose receptor
Type:
PROTEIN
Mol. Mass.:
38883.93
Organism:
Mus musculus
Description:
ChEMBL_745158
Residue:
338
  
Inhibitor
Name:
BDBM50343873
Synonyms:
7-((2,6-dimethylphenoxy)methyl)-4-phenyl-2-naphthoic acid | CHEMBL1774888
Type:
Small organic molecule
Emp. Form.:
C26H22O3
Mol. Mass.:
382.4511
SMILES:
Cc1cccc(C)c1OCc1ccc2c(cc(cc2c1)C(O)=O)-c1ccccc1
: