Target
5-hydroxytryptamine receptor 1B
Ligand
BDBM50343890
Substrate
Meas. Tech.
ChEMBL_747466 (CHEMBL1776966)
Ki
121±n/a nM
Citation
 Al Hussainy, RVerbeek, Jvan der Born, DBraker, AHLeysen, JEKnol, RJBooij, JHerscheid, JK Design, synthesis, radiolabeling, and in vitro and in vivo evaluation of bridgehead iodinated analogues of N-{2-[4-(2-methoxyphenyl)piperazin-1-yl]ethyl}-N-(pyridin-2-yl)cyclohexanecarboxamide (WAY-100635) as potential SPECT ligands for the 5-HT1A receptor. J Med Chem 54:3480-91 (2011)  
Target
Name:
5-hydroxytryptamine receptor 1B
Synonyms:
5-HT-1B 5-HT1B 5HT1B_HUMAN HTR1DB Serotonin (5-HT) receptor Serotonin Receptor 1B
Type:
G Protein-Coupled Receptor (GPCR)
Mol. Mass.:
43579.17
Organism:
Homo sapiens (Human)
Description:
Receptor binding assays were performed using human clone stably expressed in CHO cells
Residue:
390
  
Inhibitor
Name:
BDBM50343890
Synonyms:
4-Iodo-N-(2-(4-(2-methoxyphenyl)piperazin-1-yl)ethyl)-N-(pyridin-2-yl)cubyl-1-carboxamide | CHEMBL1774991
Type:
Small organic molecule
Emp. Form.:
C27H29IN4O2
Mol. Mass.:
568.4492
SMILES:
COc1ccccc1N1CCN(CCN(C(=O)C23C4C5C2C2C3C4C52I)c2ccccn2)CC1
: