Target
Mannose-6-phosphate isomerase
Ligand
BDBM46691
Substrate
Meas. Tech.
ChEMBL_747525 (CHEMBL1777059)
IC50
1900±n/a nM
Citation
 Dahl, RBravo, YSharma, VIchikawa, MDhanya, RPHedrick, MBrown, BRascon, JVicchiarelli, MMangravita-Novo, AYang, LStonich, DSu, YSmith, LHSergienko, EFreeze, HHCosford, ND Potent, selective, and orally available benzoisothiazolone phosphomannose isomerase inhibitors as probes for congenital disorder of glycosylation Ia. J Med Chem 54:3661-8 (2011)  
Target
Name:
Mannose-6-phosphate isomerase
Synonyms:
MPI MPI_HUMAN PMI1
Type:
PROTEIN
Mol. Mass.:
46651.35
Organism:
Homo sapiens (Human)
Description:
ChEMBL_1448919
Residue:
423
  
Inhibitor
Name:
BDBM46691
Synonyms:
2-(4-chlorophenyl)-1,2-benzothiazol-3-one acs.jmedchem.1c00409_ST.175 | cid_11219195
Type:
Small organic molecule
Emp. Form.:
C13H8ClNOS
Mol. Mass.:
261.727
SMILES:
Clc1ccc(cc1)-n1sc2ccccc2c1=O
: