Target
Aurora kinase A
Ligand
BDBM50343942
Substrate
Meas. Tech.
ChEMBL_748278 (CHEMBL1781288)
Ki
8.5±n/a nM
Citation
 Ando, RIkegami, HSakiyama, MOoike, SHayashi, MFujino, YAbe, DNakamura, HMishina, TKato, HIwase, YTomozane, HMorioka, M 3-Cyano-6-(5-methyl-3-pyrazoloamino)pyridines: selective Aurora A kinase inhibitors. Bioorg Med Chem Lett 20:4709-11 (2010)  
Target
Name:
Aurora kinase A
Synonyms:
AIK ARK-1 AURA AURKA_HUMAN Aurora 2 Aurora kinase A (AURKA) Aurora kinase A (Aurora-2) Aurora/IPL1-related kinase 1 Breast tumor-amplified kinase IAK1 STK15 GN Serine/threonine kinase 15 Serine/threonine-protein kinase 6 Serine/threonine-protein kinase aurora-A aurora-2 | hARK1
Type:
Serine/threonine-protein kinase
Mol. Mass.:
45830.98
Organism:
Homo sapiens (Human)
Description:
O14965
Residue:
403
  
Inhibitor
Name:
BDBM50343942
Synonyms:
2-(6-hydroxyhexylthio)-4-methyl-6-(5-methyl-1H-pyrazol-3-ylamino)nicotinonitrile | CHEMBL1777841
Type:
Small organic molecule
Emp. Form.:
C17H23N5OS
Mol. Mass.:
345.462
SMILES:
Cc1cc(Nc2cc(C)c(C#N)c(SCCCCCCO)n2)[nH]n1
: