Target
Cytochrome P450 1A1
Ligand
BDBM50025321
Substrate
Meas. Tech.
ChEMBL_748492 (CHEMBL1780345)
Ki
>800±n/a nM
Citation
 Androutsopoulos, VPPapakyriakou, AVourloumis, DSpandidos, DA Comparative CYP1A1 and CYP1B1 substrate and inhibitor profile of dietary flavonoids. Bioorg Med Chem 19:2842-9 (2011)  
Target
Name:
Cytochrome P450 1A1
Synonyms:
CP1A1_HUMAN CYPIA1 Cytochrome P450 1A1 P450 form 6 P450-P1
Type:
Protein
Mol. Mass.:
58177.23
Organism:
Homo sapiens (Human)
Description:
P04798
Residue:
512
  
Inhibitor
Name:
BDBM50025321
Synonyms:
2-(3,4-Dihydroxy-phenyl)-5-hydroxy-6,7-dimethoxy-chromen-4-one 5,3',4'-Trihydroxy-6,7-dimethoxyflavone Cirsiliol
Type:
Small organic molecule
Emp. Form.:
C17H14O7
Mol. Mass.:
330.2889
SMILES:
COc1cc2oc(cc(=O)c2c(O)c1OC)-c1ccc(O)c(O)c1
: