Target
B1 bradykinin receptor
Ligand
BDBM50344112
Substrate
Meas. Tech.
ChEMBL_748611 (CHEMBL1780464)
Ki
1.98±n/a nM
Citation
 Chen, JJNguyen, TD'Amico, DCQian, WHuman, JAya, TBiswas, KFotsch, CHan, NLiu, QNishimura, NPeterkin, TAYang, KZhu, JRiahi, BBHungate, RWAndersen, NGColyer, JTFaul, MMKamassah, AWang, JJona, JKumar, GJohnson, EAskew, BC 3-Oxo-2-piperazinyl acetamides as potent bradykinin B1 receptor antagonists for the treatment of pain and inflammation. Bioorg Med Chem Lett 21:3384-9 (2011)  
Target
Name:
B1 bradykinin receptor
Synonyms:
B1 BRADYKININ B1R BK-1 receptor BRADYB1 | Bradykinin B1 receptor
Type:
Enzyme
Mol. Mass.:
40508.87
Organism:
Homo sapiens (Human)
Description:
P46663
Residue:
353
  
Inhibitor
Name:
BDBM50344112
Synonyms:
CHEMBL1777970 | N-((R)-6-((3,3-dimethylpiperidin-1-yl)methyl)-1,2,3,4-tetrahydronaphthalen-1-yl)-2-((R)-3-oxo-1-tosylpiperazin-2-yl)acetamide
Type:
Small organic molecule
Emp. Form.:
C31H42N4O4S
Mol. Mass.:
566.755
SMILES:
Cc1ccc(cc1)S(=O)(=O)N1CCNC(=O)[C@H]1CC(=O)N[C@@H]1CCCc2cc(CN3CCCC(C)(C)C3)ccc12
: