Target
B1 bradykinin receptor
Ligand
BDBM50344110
Substrate
Meas. Tech.
ChEMBL_748609 (CHEMBL1780462)
IC50
0.4±n/a nM
Citation
 Chen, JJNguyen, TD'Amico, DCQian, WHuman, JAya, TBiswas, KFotsch, CHan, NLiu, QNishimura, NPeterkin, TAYang, KZhu, JRiahi, BBHungate, RWAndersen, NGColyer, JTFaul, MMKamassah, AWang, JJona, JKumar, GJohnson, EAskew, BC 3-Oxo-2-piperazinyl acetamides as potent bradykinin B1 receptor antagonists for the treatment of pain and inflammation. Bioorg Med Chem Lett 21:3384-9 (2011)  
Target
Name:
B1 bradykinin receptor
Synonyms:
B1 BRADYKININ B1R BK-1 receptor BRADYB1 | Bradykinin B1 receptor
Type:
Enzyme
Mol. Mass.:
40508.87
Organism:
Homo sapiens (Human)
Description:
P46663
Residue:
353
  
Inhibitor
Name:
BDBM50344110
Synonyms:
2-((R)-3-oxo-1-tosylpiperazin-2-yl)-N-((R)-7-(piperidin-1-ylmethyl)chroman-4-yl)acetamide | CHEMBL1777968
Type:
Small organic molecule
Emp. Form.:
C28H36N4O5S
Mol. Mass.:
540.674
SMILES:
Cc1ccc(cc1)S(=O)(=O)N1CCNC(=O)[C@H]1CC(=O)N[C@@H]1CCOc2cc(CN3CCCCC3)ccc12
: