Target
Neprilysin
Ligand
BDBM50344196
Substrate
Meas. Tech.
ChEMBL_748203 (CHEMBL1780284)
IC50
6±n/a nM
Citation
 Glossop, MSBazin, RJDack, KNFox, DNMacDonald, GAMills, MOwen, DRPhillips, CReeves, KARinger, TJStrang, RSWatson, CA Synthesis and evaluation of heteroarylalanine diacids as potent and selective neutral endopeptidase inhibitors. Bioorg Med Chem Lett 21:3404-6 (2011)  
Target
Name:
Neprilysin
Synonyms:
Atriopeptidase CD_antigen=CD10 EPN MME NEP_HUMAN Neutral endopeptidase | Neutral endopeptidase 24.11
Type:
Enzyme
Mol. Mass.:
85505.38
Organism:
Homo sapiens (Human)
Description:
P08473
Residue:
750
  
Inhibitor
Name:
BDBM50344196
Synonyms:
(S)-2-(1-((S)-1-carboxy-2-(5-phenyl-1,3,4-oxadiazol-2-yl)ethylcarbamoyl)cyclopentylamino)-4-methoxybutanoic acid | CHEMBL1778535
Type:
Small organic molecule
Emp. Form.:
C22H28N4O7
Mol. Mass.:
460.4803
SMILES:
COCC[C@H](NC1(CCCC1)C(=O)N[C@@H](Cc1nnc(o1)-c1ccccc1)C(O)=O)C(O)=O
: