Target
cGMP-specific 3',5'-cyclic phosphodiesterase
Ligand
BDBM50344315
Substrate
Meas. Tech.
ChEMBL_748500 (CHEMBL1780353)
IC50
156000±n/a nM
Citation
 Allcock, RWBlakli, HJiang, ZJohnston, KAMorgan, KMRosair, GMIwase, KKohno, YAdams, DR Phosphodiesterase inhibitors. Part 1: Synthesis and structure-activity relationships of pyrazolopyridine-pyridazinone PDE inhibitors developed from ibudilast. Bioorg Med Chem Lett 21:3307-12 (2011)  
Target
Name:
cGMP-specific 3',5'-cyclic phosphodiesterase
Synonyms:
3',5'-cyclic phosphodiesterase PDE5 PDE5A_HUMAN Phosphodiesterase 5 (PDE5) Phosphodiesterase 5A (PDE5A) cGMP-specific 3',5'-cyclic phosphodiesterase
Type:
Protein
Mol. Mass.:
99975.83
Organism:
Homo sapiens (Human)
Description:
O76074
Residue:
875
  
Inhibitor
Name:
BDBM50344315
Synonyms:
5,6-Dihydro-2H-1,2,7,7a-tetraaza-benzo[c]fluoren-3-one | CHEMBL1779433
Type:
Small organic molecule
Emp. Form.:
C13H10N4O
Mol. Mass.:
238.2447
SMILES:
O=c1cc2CCc3nn4ccccc4c3-c2n[nH]1
: