Target
cAMP-specific 3',5'-cyclic phosphodiesterase 4B
Ligand
BDBM50344309
Substrate
Meas. Tech.
ChEMBL_748499 (CHEMBL1780352)
IC50
114000±n/a nM
Citation
 Allcock, RWBlakli, HJiang, ZJohnston, KAMorgan, KMRosair, GMIwase, KKohno, YAdams, DR Phosphodiesterase inhibitors. Part 1: Synthesis and structure-activity relationships of pyrazolopyridine-pyridazinone PDE inhibitors developed from ibudilast. Bioorg Med Chem Lett 21:3307-12 (2011)  
Target
Name:
cAMP-specific 3',5'-cyclic phosphodiesterase 4B
Synonyms:
3',5'-cyclic phosphodiesterase Isoform PDE4B1 PDE4B PDE4B_HUMAN Phosphodiesterase 4B (PDE4B) Phosphodiesterase Type 4 (PDE4B)
Type:
Protein
Mol. Mass.:
83318.87
Organism:
Homo sapiens (Human)
Description:
Q07343
Residue:
736
  
Inhibitor
Name:
BDBM50344309
Synonyms:
6-(2-isopropylpyrazolo[1,5-a]pyridin-3-yl)pyridazin-3(2H)-one | CHEMBL1777830
Type:
Small organic molecule
Emp. Form.:
C14H14N4O
Mol. Mass.:
254.2872
SMILES:
CC(C)c1nn2ccccc2c1-c1ccc(=O)[nH]n1
: