Target
cAMP-specific 3',5'-cyclic phosphodiesterase 4B
Ligand
BDBM50344316
Substrate
Meas. Tech.
ChEMBL_748499 (CHEMBL1780352)
IC50
16000±n/a nM
Citation
 Allcock, RWBlakli, HJiang, ZJohnston, KAMorgan, KMRosair, GMIwase, KKohno, YAdams, DR Phosphodiesterase inhibitors. Part 1: Synthesis and structure-activity relationships of pyrazolopyridine-pyridazinone PDE inhibitors developed from ibudilast. Bioorg Med Chem Lett 21:3307-12 (2011)  
Target
Name:
cAMP-specific 3',5'-cyclic phosphodiesterase 4B
Synonyms:
3',5'-cyclic phosphodiesterase Isoform PDE4B1 PDE4B PDE4B_HUMAN Phosphodiesterase 4B (PDE4B) Phosphodiesterase Type 4 (PDE4B)
Type:
Protein
Mol. Mass.:
83318.87
Organism:
Homo sapiens (Human)
Description:
Q07343
Residue:
736
  
Inhibitor
Name:
BDBM50344316
Synonyms:
2-Benzyl-5,6-dihydro-2H-1,2,7,7a-tetraaza-benzo[c]fluoren-3-one | CHEMBL1779434
Type:
Small organic molecule
Emp. Form.:
C20H16N4O
Mol. Mass.:
328.3672
SMILES:
O=c1cc2CCc3nn4ccccc4c3-c2nn1Cc1ccccc1
: