Target
Transient receptor potential cation channel subfamily V member 1
Ligand
BDBM50344345
Substrate
Meas. Tech.
ChEMBL_748632 (CHEMBL1780485)
IC50
3.5±n/a nM
Citation
 Urbahns, KYura, TMogi, MTajimi, MFujishima, HMasuda, TYoshida, NMoriwaki, TLowinger, TBMeier, HChan, FMadge, DGupta, JB Naphthol derivatives as TRPV1 inhibitors for the treatment of urinary incontinence. Bioorg Med Chem Lett 21:3354-7 (2011)  
Target
Name:
Transient receptor potential cation channel subfamily V member 1
Synonyms:
Capsaicin receptor Osm-9-like TRP channel 1 TRPV1_HUMAN Transient receptor potential cation channel subfamily V member 1 (TRPV1) Transient receptor potential cation channel subfamily V member 1(TRPV1) Vanilloid VR1 Vanilloid receptor 1 Vanilloid receptor 1 (VRI/TRPV1)
Type:
Protein
Mol. Mass.:
94960.75
Organism:
Homo sapiens (Human)
Description:
Q8NER1
Residue:
839
  
Inhibitor
Name:
BDBM50344345
Synonyms:
1-(7-hydroxynaphthalen-1-yl)-3-(3-(trifluoromethyl)phenyl)urea | CHEMBL1779665
Type:
Small organic molecule
Emp. Form.:
C18H13F3N2O2
Mol. Mass.:
346.3032
SMILES:
Oc1ccc2cccc(NC(=O)Nc3cccc(c3)C(F)(F)F)c2c1
: