Target
RAF proto-oncogene serine/threonine-protein kinase
Ligand
BDBM50344528
Substrate
Meas. Tech.
ChEMBL_747956 (CHEMBL1781333)
IC50
9±n/a nM
Citation
 Ramurthy, SAikawa, MAmiri, PCostales, AHashash, AJansen, JMLin, SMa, SRenhowe, PAShafer, CMSubramanian, SSung, LVerhagen, J Design and synthesis of 5,6-fused heterocyclic amides as Raf kinase inhibitors. Bioorg Med Chem Lett 21:3286-9 (2011)  
Target
Name:
RAF proto-oncogene serine/threonine-protein kinase
Synonyms:
C-Raf Protein Kinase RAF RAF1 Raf-1 Serine/threonine-protein kinase C-Raf | cRaf
Type:
Serine/threonine-protein kinase
Mol. Mass.:
73082.52
Organism:
Homo sapiens (Human)
Description:
P04049
Residue:
648
  
Inhibitor
Name:
BDBM50344528
Synonyms:
4-(2-(4-butylphenylamino)benzo[d]thiazol-5-yloxy)-N-methylpicolinamide | CHEMBL1778407
Type:
Small organic molecule
Emp. Form.:
C24H24N4O2S
Mol. Mass.:
432.538
SMILES:
CCCCc1ccc(Nc2nc3cc(Oc4ccnc(c4)C(=O)NC)ccc3s2)cc1
: