Target
RAF proto-oncogene serine/threonine-protein kinase
Ligand
BDBM50344538
Substrate
Meas. Tech.
ChEMBL_747956 (CHEMBL1781333)
IC50
2±n/a nM
Citation
 Ramurthy, SAikawa, MAmiri, PCostales, AHashash, AJansen, JMLin, SMa, SRenhowe, PAShafer, CMSubramanian, SSung, LVerhagen, J Design and synthesis of 5,6-fused heterocyclic amides as Raf kinase inhibitors. Bioorg Med Chem Lett 21:3286-9 (2011)  
Target
Name:
RAF proto-oncogene serine/threonine-protein kinase
Synonyms:
C-Raf Protein Kinase RAF RAF1 Raf-1 Serine/threonine-protein kinase C-Raf | cRaf
Type:
Serine/threonine-protein kinase
Mol. Mass.:
73082.52
Organism:
Homo sapiens (Human)
Description:
P04049
Residue:
648
  
Inhibitor
Name:
BDBM50344538
Synonyms:
CHEMBL1778397 | N-methyl-4-(2-(4-(trifluoromethoxy)phenylamino)benzo[d]oxazol-5-yloxy)picolinamide
Type:
Small organic molecule
Emp. Form.:
C21H15F3N4O4
Mol. Mass.:
444.3634
SMILES:
CNC(=O)c1cc(Oc2ccc3oc(Nc4ccc(OC(F)(F)F)cc4)nc3c2)ccn1
: