Target
Fructose-1,6-bisphosphatase 1
Ligand
BDBM50344568
Substrate
Meas. Tech.
ChEMBL_748173 (CHEMBL1781852)
IC50
8000±n/a nM
Citation
 Hebeisen, PHaap, WKuhn, BMohr, PWessel, HPZutter, UKirchner, SRuf, ABenz, JJoseph, CAlvarez-Sánchez, RGubler, MSchott, BBenardeau, ATozzo, EKitas, E Orally active aminopyridines as inhibitors of tetrameric fructose-1,6-bisphosphatase. Bioorg Med Chem Lett 21:3237-42 (2011)  
Target
Name:
Fructose-1,6-bisphosphatase 1
Synonyms:
F16P1_MOUSE Fbp1 | Fbp3
Type:
PROTEIN
Mol. Mass.:
36912.07
Organism:
Mus musculus
Description:
ChEMBL_748173
Residue:
338
  
Inhibitor
Name:
BDBM50344568
Synonyms:
CHEMBL1778446 | N-(7-bromoimidazo[1,2-a]pyridin-5-ylcarbamoyl)-5-(2-methoxyethyl)-4-methylthiophene-2-sulfonamide
Type:
Small organic molecule
Emp. Form.:
C16H17BrN4O4S2
Mol. Mass.:
473.365
SMILES:
COCCc1sc(cc1C)S(=O)(=O)NC(=O)Nc1cc(Br)cc2nccn12
: