Target
Hepatocyte growth factor receptor
Ligand
BDBM50344642
Substrate
Meas. Tech.
ChEMBL_748983 (CHEMBL1781431)
IC50
28300±n/a nM
Citation
 Liang, ZZhang, DAi, JChen, LWang, HKong, XZheng, MLiu, HLuo, CGeng, MJiang, HChen, K Identification and synthesis of N'-(2-oxoindolin-3-ylidene)hydrazide derivatives against c-Met kinase. Bioorg Med Chem Lett 21:3749-54 (2011)  
Target
Name:
Hepatocyte growth factor receptor
Synonyms:
Hepatocyte growth factor receptor Hepatocyte growth factor receptor (c-MET) MET Met proto-oncogene (hepatocyte growth factor receptor) Tyrosine-protein kinase Met (c-Met) c-Met kinase
Type:
Protein
Mol. Mass.:
155559.73
Organism:
Homo sapiens (Human)
Description:
P08581
Residue:
1390
  
Inhibitor
Name:
BDBM50344642
Synonyms:
4-nitro-N'-(2-oxoindolin-3-ylidene)benzohydrazide | CHEMBL1779067
Type:
Small organic molecule
Emp. Form.:
C15H10N4O4
Mol. Mass.:
310.2643
SMILES:
[O-][N+](=O)c1ccc(cc1)C(=O)NN=C1C(=O)Nc2ccccc12
: