Target
Dipeptidyl peptidase 4
Ligand
BDBM50344762
Substrate
Meas. Tech.
ChEMBL_749181 (CHEMBL1780909)
IC50
92.6±n/a nM
Citation
 Kim, HJKwak, WYMin, JPLee, JYYoon, THKim, HDShin, CYKim, MKChoi, SHKim, HSYang, EKCheong, YHChae, YNPark, KJJang, JMChoi, SJSon, MHKim, SHYoo, MLee, BJ Discovery of DA-1229: a potent, long acting dipeptidyl peptidase-4 inhibitor for the treatment of type 2 diabetes. Bioorg Med Chem Lett 21:3809-12 (2011)  
Target
Name:
Dipeptidyl peptidase 4
Synonyms:
ADABP Adenosine deaminase complexing protein 2 CD_antigen=CD26 DPP4 DPPIV Dipeptidyl peptidase 4 (DPP IV) Dipeptidyl peptidase 4 (DPP4) Dipeptidyl peptidase 4 membrane form Dipeptidyl peptidase IV Dipeptidyl peptidase IV (DDP-IV) Dipeptidyl peptidase IV membrane form Dipeptidyl peptidase-IV (DPP-4) T-cell activation antigen CD26 | TP103
Type:
Enzyme
Mol. Mass.:
88271.01
Organism:
Homo sapiens (Human)
Description:
P27487
Residue:
766
  
Inhibitor
Name:
BDBM50344762
Synonyms:
(R)-4-(3-amino-4-(2,4,5-trifluorophenyl)butanoyl)-1-methylpiperazin-2-one | CHEMBL1779688
Type:
Small organic molecule
Emp. Form.:
C15H18F3N3O2
Mol. Mass.:
329.3175
SMILES:
CN1CCN(CC1=O)C(=O)C[C@H](N)Cc1cc(F)c(F)cc1F
: