Target
Prostaglandin G/H synthase 2
Ligand
BDBM50344888
Substrate
Meas. Tech.
ChEMBL_748672 (CHEMBL1780525)
IC50
3000±n/a nM
Citation
 El-Sayed, MAAbdel-Aziz, NIAbdel-Aziz, AAEl-Azab, ASAsiri, YAEltahir, KE Design, synthesis, and biological evaluation of substituted hydrazone and pyrazole derivatives as selective COX-2 inhibitors: Molecular docking study. Bioorg Med Chem 19:3416-24 (2011)  
Target
Name:
Prostaglandin G/H synthase 2
Synonyms:
COX2 Cyclooxygenase-2 (COX-2) PTGS2 Prostaglandin G/H synthase (cyclooxygenase)
Type:
Protein
Mol. Mass.:
68976.98
Organism:
Ovis aries (Sheep)
Description:
Residue:
603
  
Inhibitor
Name:
BDBM50344888
Synonyms:
3-(4-Chlorophenyl)-4-(2-(4-bromophenyl)hydrazono)-5-trifuoromethyl)-4H-pyrazole | CHEMBL1780073
Type:
Small organic molecule
Emp. Form.:
C16H9BrClF3N4
Mol. Mass.:
429.622
SMILES:
FC(F)(F)c1[nH]nc(c1N=Nc1ccc(Br)cc1)-c1ccc(Cl)cc1
: