Target
Prostaglandin E synthase
Ligand
BDBM50006805
Substrate
Meas. Tech.
ChEMBL_748820 (CHEMBL1781668)
IC50
2400±n/a nM
Citation
 Greiner, CZettl, HKoeberle, APergola, CNorthoff, HSchubert-Zsilavecz, MWerz, O Identification of 2-mercaptohexanoic acids as dual inhibitors of 5-lipoxygenase and microsomal prostaglandin E2 synthase-1. Bioorg Med Chem 19:3394-401 (2011)  
Target
Name:
Prostaglandin E synthase
Synonyms:
MGST1L1 PGES PTGES Prostaglandin E synthase (PGES-1) Prostaglandin E synthase-1 (PGES-1) Prostaglandin E2 synthase-1 ( mPGES-1)
Type:
Protein
Mol. Mass.:
17112.22
Organism:
Homo sapiens (Human)
Description:
Residue:
152
  
Inhibitor
Name:
BDBM50006805
Synonyms:
3-(1-(4-chlorobenzyl)-3-(tert-butylthio)-5-isopropyl-1H-indol-2-yl)-2,2-dimethylpropanoic acid 3-[1-(4-chlorobenzyl)-3-t-butyl-thio-5-isopropylindol-2-yl]-2,2-dimethylpropanoic acid CHEMBL29097 MK886 | cid_3651377
Type:
Small organic molecule
Emp. Form.:
C27H34ClNO2S
Mol. Mass.:
472.082
SMILES:
CC(C)c1ccc2n(Cc3ccc(Cl)cc3)c(CC(C)(C)C(O)=O)c(SC(C)(C)C)c2c1
: