Target
Carbonic anhydrase 1
Ligand
BDBM26978
Substrate
Meas. Tech.
ChEMBL_748877 (CHEMBL1781041)
pH
8.3±n/a
Ki
>300000000±n/a nM
Comments
extracted
Citation
 Vullo, DNishimori, IMinakuchi, TScozzafava, ASupuran, CT Inhibition studies with anions and small molecules of two novel β-carbonic anhydrases from the bacterial pathogen Salmonella enterica serovar Typhimurium. Bioorg Med Chem Lett 21:3591-5 (2011)  
Target
Name:
Carbonic anhydrase 1
Synonyms:
CA-I CAB Carbonate dehydratase I Carbonic anhydrase 1 (CA I) Carbonic anhydrase 1 (Recombinant CA I) Carbonic anhydrase B Carbonic anhydrase I (CA I) Carbonic anhydrase I (CAI) Carbonic anhydrase isoenzyme I (hCA I) | hCA
Type:
Enzyme
Mol. Mass.:
28873.37
Organism:
Homo sapiens (Human)
Description:
P00915
Residue:
261
  
Inhibitor
Name:
BDBM26978
Synonyms:
BDBM50098540 CHEMBL1644027 fluoride | fluoride ion
Type:
Ion
Emp. Form.:
F
Mol. Mass.:
18.9989518
SMILES:
[F-]
: