Target
Vasopressin V1b receptor
Ligand
BDBM50299343
Substrate
Meas. Tech.
ChEMBL_748738 (CHEMBL1780591)
Ki
1.7±n/a nM
Citation
 Oost, TBackfisch, GBhowmik, Svan Gaalen, MMGeneste, HHornberger, WLubisch, WNetz, AUnger, LWernet, W Potent and selective oxindole-based vasopressin 1b receptor antagonists with improved pharmacokinetic properties. Bioorg Med Chem Lett 21:3828-31 (2011)  
Target
Name:
Vasopressin V1b receptor
Synonyms:
AVPR V1b AVPR1B Antidiuretic hormone receptor 1b V1bR VPR3 Vasopressin V1b receptor (V1b) Vasopressin V3 receptor
Type:
Enzyme
Mol. Mass.:
46985.01
Organism:
Homo sapiens (Human)
Description:
P47901
Residue:
424
  
Inhibitor
Name:
BDBM50299343
Synonyms:
(2S,4R)-1-((R)-5-chloro-1-(2,4-dimethoxyphenylsulfonyl)-3-(2-methoxyphenyl)-2-oxoindolin-3-yl)-4-hydroxy-N,N-dimethylpyrrolidine-2-carboxamide CHEMBL582857 SSR149415
Type:
Small organic molecule
Emp. Form.:
C30H32ClN3O8S
Mol. Mass.:
630.108
SMILES:
COc1ccc(c(OC)c1)S(=O)(=O)N1C(=O)[C@@](N2C[C@H](O)C[C@H]2C(=O)N(C)C)(c2cc(Cl)ccc12)c1ccccc1OC
: